Вопрос Как я могу исправить драйвер Wi-Fi Broadcom с ядром 4.15.0-xx на Ubuntu 16.04


Я переустановил драйвер для Windows для сетевого адаптера Broadcom, и после этого мой WiFi полностью отключился от Ubuntu (16.04).

Я попытался переустановить драйверы, используя следующие команды:

1. sudo apt-get purge bcmwl-kernel-source
2. sudo apt-get install bcmwl-kernel-source

Но это не помогло

Вывод второй команды (установите bcmwl-kernel-source):

Unpacking bcmwl-kernel-source (6.30.223.271+bdcom-0ubuntu1~1.2) ...
Setting up bcmwl-kernel-source (6.30.223.271+bdcom-0ubuntu1~1.2) ...
Loading new bcmwl-6.30.223.271+bdcom DKMS files...
First Installation: checking all kernels...
Building only for 4.15.0-24-generic
Building for architecture x86_64
Building initial module for 4.15.0-24-generic
ERROR: Cannot create report: [Errno 17] File exists: '/var/crash/bcmwl-kernel-source.0.crash'
Error! Bad return status for module build on kernel: 4.15.0-24-generic (x86_64)
Consult /var/lib/dkms/bcmwl/6.30.223.271+bdcom/build/make.log for more information.
modprobe: FATAL: Module wl not found in directory /lib/modules/4.15.0-24-generic
update-initramfs: deferring update (trigger activated)
Processing triggers for initramfs-tools (0.122ubuntu8.11) ...
update-initramfs: Generating /boot/initrd.img-4.15.0-24-generic
W: Possible missing firmware /lib/firmware/i915/kbl_guc_ver9_14.bin for module i915
W: Possible missing firmware /lib/firmware/i915/bxt_guc_ver8_7.bin for module i915
root@roman-Lenovo-G510:~# apt-get install bcmwl-kernel-source
Reading package lists... Done
Building dependency tree       
Reading state information... Done
bcmwl-kernel-source is already the newest version (6.30.223.271+bdcom-0ubuntu1~1.2).

Эта команда lspci -nn -d 14e4 выходы:

08:00.0 Network controller [0280]: Broadcom Limited BCM43142 802.11b/g/n [14e4:4365] (rev 01)

Не могли бы вы рассказать мне, как исправить мою проблему?

/var/crash/bcmwl-kernel-source.0.crash

ProblemType: Package
DKMSBuildLog:
 DKMS make.log for bcmwl-6.30.223.271+bdcom for kernel 4.15.0-24-generic (x86_64)
 Вт июл  3 16:26:40 MSK 2018
 make: Entering directory '/usr/src/linux-headers-4.15.0-24-generic'
 Makefile:976: "Cannot use CONFIG_STACK_VALIDATION=y, please install libelf-dev, libelf-devel or elfutils-libelf-devel"
 CFG80211 API is prefered for this kernel version
 Using CFG80211 API
   CC [M]  /var/lib/dkms/bcmwl/6.30.223.271+bdcom/build/src/shared/linux_osl.o
 /var/lib/dkms/bcmwl/6.30.223.271+bdcom/build/src/shared/linux_osl.c: In function ‘osl_os_get_image_block’:
 /var/lib/dkms/bcmwl/6.30.223.271+bdcom/build/src/shared/linux_osl.c:1083:26: warning: passing argument 2 of ‘kernel_read’ makes pointer from integer without a cast [-Wint-conversion]
   rdlen = kernel_read(fp, fp->f_pos, buf, len);
                           ^
 In file included from ./include/linux/huge_mm.h:7:0,
                  from ./include/linux/mm.h:463,
                  from /var/lib/dkms/bcmwl/6.30.223.271+bdcom/build/src/include/linuxver.h:65,
                  from /var/lib/dkms/bcmwl/6.30.223.271+bdcom/build/src/shared/linux_osl.c:25:
 ./include/linux/fs.h:2858:16: note: expected ‘void *’ but argument is of type ‘loff_t {aka long long int}’
  extern ssize_t kernel_read(struct file *, void *, size_t, loff_t *);
                 ^
 /var/lib/dkms/bcmwl/6.30.223.271+bdcom/build/src/shared/linux_osl.c:1083:37: warning: passing argument 3 of ‘kernel_read’ makes integer from pointer without a cast [-Wint-conversion]
   rdlen = kernel_read(fp, fp->f_pos, buf, len);
                                      ^
 In file included from ./include/linux/huge_mm.h:7:0,
                  from ./include/linux/mm.h:463,
                  from /var/lib/dkms/bcmwl/6.30.223.271+bdcom/build/src/include/linuxver.h:65,
                  from /var/lib/dkms/bcmwl/6.30.223.271+bdcom/build/src/shared/linux_osl.c:25:
 ./include/linux/fs.h:2858:16: note: expected ‘size_t {aka long unsigned int}’ but argument is of type ‘char *’
  extern ssize_t kernel_read(struct file *, void *, size_t, loff_t *);
                 ^
 /var/lib/dkms/bcmwl/6.30.223.271+bdcom/build/src/shared/linux_osl.c:1083:42: warning: passing argument 4 of ‘kernel_read’ makes pointer from integer without a cast [-Wint-conversion]
   rdlen = kernel_read(fp, fp->f_pos, buf, len);
                                           ^
 In file included from ./include/linux/huge_mm.h:7:0,
                  from ./include/linux/mm.h:463,
                  from /var/lib/dkms/bcmwl/6.30.223.271+bdcom/build/src/include/linuxver.h:65,
                  from /var/lib/dkms/bcmwl/6.30.223.271+bdcom/build/src/shared/linux_osl.c:25:
 ./include/linux/fs.h:2858:16: note: expected ‘loff_t * {aka long long int *}’ but argument is of type ‘int’
  extern ssize_t kernel_read(struct file *, void *, size_t, loff_t *);
                 ^
   CC [M]  /var/lib/dkms/bcmwl/6.30.223.271+bdcom/build/src/wl/sys/wl_linux.o
 /var/lib/dkms/bcmwl/6.30.223.271+bdcom/build/src/wl/sys/wl_linux.c: In function ‘wl_init_timer’:
 /var/lib/dkms/bcmwl/6.30.223.271+bdcom/build/src/wl/sys/wl_linux.c:2359:2: error: implicit declaration of function ‘init_timer’ [-Werror=implicit-function-declaration]
   init_timer(&t->timer);
   ^
 /var/lib/dkms/bcmwl/6.30.223.271+bdcom/build/src/wl/sys/wl_linux.c:2360:10: error: ‘struct timer_list’ has no member named ‘data’
   t->timer.data = (ulong) t;
           ^
 /var/lib/dkms/bcmwl/6.30.223.271+bdcom/build/src/wl/sys/wl_linux.c:2361:20: error: assignment from incompatible pointer type [-Werror=incompatible-pointer-types]
   t->timer.function = wl_timer;
                     ^
 cc1: some warnings being treated as errors
 scripts/Makefile.build:332: recipe for target '/var/lib/dkms/bcmwl/6.30.223.271+bdcom/build/src/wl/sys/wl_linux.o' failed
 make[1]: *** [/var/lib/dkms/bcmwl/6.30.223.271+bdcom/build/src/wl/sys/wl_linux.o] Error 1
 Makefile:1552: recipe for target '_module_/var/lib/dkms/bcmwl/6.30.223.271+bdcom/build' failed
 make: *** [_module_/var/lib/dkms/bcmwl/6.30.223.271+bdcom/build] Error 2
 make: Leaving directory '/usr/src/linux-headers-4.15.0-24-generic'
DKMSKernelVersion: 4.15.0-24-generic
Date: Tue Jul  3 16:26:46 2018
DuplicateSignature: dkms:bcmwl-kernel-source:6.30.223.271+bdcom-0ubuntu1~1.2:/var/lib/dkms/bcmwl/6.30.223.271+bdcom/build/src/wl/sys/wl_linux.c:2359:2: error: implicit declaration of function ‘init_timer’ [-Werror=implicit-function-declaration]
Package: bcmwl-kernel-source 6.30.223.271+bdcom-0ubuntu1~1.2
PackageVersion: 6.30.223.271+bdcom-0ubuntu1~1.2
SourcePackage: bcmwl
Title: bcmwl-kernel-source 6.30.223.271+bdcom-0ubuntu1~1.2: bcmwl kernel module failed to build

/var/lib/dkms/bcmwl/6.30.223.271+bdcom/build/make.log

DKMS make.log for bcmwl-6.30.223.271+bdcom for kernel 4.15.0-24-generic (x86_64)
Чт июл  5 16:26:16 MSK 2018
make: Entering directory '/usr/src/linux-headers-4.15.0-24-generic'
Makefile:976: "Cannot use CONFIG_STACK_VALIDATION=y, please install libelf-dev, libelf-devel or elfutils-libelf-devel"
CFG80211 API is prefered for this kernel version
Using CFG80211 API
  CC [M]  /var/lib/dkms/bcmwl/6.30.223.271+bdcom/build/src/shared/linux_osl.o
/var/lib/dkms/bcmwl/6.30.223.271+bdcom/build/src/shared/linux_osl.c: In function ‘osl_os_get_image_block’:
/var/lib/dkms/bcmwl/6.30.223.271+bdcom/build/src/shared/linux_osl.c:1083:26: warning: passing argument 2 of ‘kernel_read’ makes pointer from integer without a cast [-Wint-conversion]
  rdlen = kernel_read(fp, fp->f_pos, buf, len);
                          ^
In file included from ./include/linux/huge_mm.h:7:0,
                 from ./include/linux/mm.h:463,
                 from /var/lib/dkms/bcmwl/6.30.223.271+bdcom/build/src/include/linuxver.h:65,
                 from /var/lib/dkms/bcmwl/6.30.223.271+bdcom/build/src/shared/linux_osl.c:25:
./include/linux/fs.h:2858:16: note: expected ‘void *’ but argument is of type ‘loff_t {aka long long int}’
 extern ssize_t kernel_read(struct file *, void *, size_t, loff_t *);
                ^
/var/lib/dkms/bcmwl/6.30.223.271+bdcom/build/src/shared/linux_osl.c:1083:37: warning: passing argument 3 of ‘kernel_read’ makes integer from pointer without a cast [-Wint-conversion]
  rdlen = kernel_read(fp, fp->f_pos, buf, len);
                                     ^
In file included from ./include/linux/huge_mm.h:7:0,
                 from ./include/linux/mm.h:463,
                 from /var/lib/dkms/bcmwl/6.30.223.271+bdcom/build/src/include/linuxver.h:65,
                 from /var/lib/dkms/bcmwl/6.30.223.271+bdcom/build/src/shared/linux_osl.c:25:
./include/linux/fs.h:2858:16: note: expected ‘size_t {aka long unsigned int}’ but argument is of type ‘char *’
 extern ssize_t kernel_read(struct file *, void *, size_t, loff_t *);
                ^
/var/lib/dkms/bcmwl/6.30.223.271+bdcom/build/src/shared/linux_osl.c:1083:42: warning: passing argument 4 of ‘kernel_read’ makes pointer from integer without a cast [-Wint-conversion]
  rdlen = kernel_read(fp, fp->f_pos, buf, len);
                                          ^
In file included from ./include/linux/huge_mm.h:7:0,
                 from ./include/linux/mm.h:463,
                 from /var/lib/dkms/bcmwl/6.30.223.271+bdcom/build/src/include/linuxver.h:65,
                 from /var/lib/dkms/bcmwl/6.30.223.271+bdcom/build/src/shared/linux_osl.c:25:
./include/linux/fs.h:2858:16: note: expected ‘loff_t * {aka long long int *}’ but argument is of type ‘int’
 extern ssize_t kernel_read(struct file *, void *, size_t, loff_t *);
                ^
  CC [M]  /var/lib/dkms/bcmwl/6.30.223.271+bdcom/build/src/wl/sys/wl_linux.o
/var/lib/dkms/bcmwl/6.30.223.271+bdcom/build/src/wl/sys/wl_linux.c: In function ‘wl_init_timer’:
/var/lib/dkms/bcmwl/6.30.223.271+bdcom/build/src/wl/sys/wl_linux.c:2359:2: error: implicit declaration of function ‘init_timer’ [-Werror=implicit-function-declaration]
  init_timer(&t->timer);
  ^
/var/lib/dkms/bcmwl/6.30.223.271+bdcom/build/src/wl/sys/wl_linux.c:2360:10: error: ‘struct timer_list’ has no member named ‘data’
  t->timer.data = (ulong) t;
          ^
/var/lib/dkms/bcmwl/6.30.223.271+bdcom/build/src/wl/sys/wl_linux.c:2361:20: error: assignment from incompatible pointer type [-Werror=incompatible-pointer-types]
  t->timer.function = wl_timer;
                    ^
cc1: some warnings being treated as errors
scripts/Makefile.build:332: recipe for target '/var/lib/dkms/bcmwl/6.30.223.271+bdcom/build/src/wl/sys/wl_linux.o' failed
make[1]: *** [/var/lib/dkms/bcmwl/6.30.223.271+bdcom/build/src/wl/sys/wl_linux.o] Error 1
Makefile:1552: recipe for target '_module_/var/lib/dkms/bcmwl/6.30.223.271+bdcom/build' failed
make: *** [_module_/var/lib/dkms/bcmwl/6.30.223.271+bdcom/build] Error 2
make: Leaving directory '/usr/src/linux-headers-4.15.0-24-generic'

22
2017-07-05 13:11


происхождения


Пожалуйста, приложите /var/crash/bcmwl-kernel-source.0.crash а также /var/lib/dkms/bcmwl/6.30.223.271+bdcom/build/make.log Чтобы получить больше информации. - SudoSURoot
@SudoSURoot Готово! - John Kent
Я вижу, что оба журнала говорят: пожалуйста, установите libelf-dev, libelf-devel или elfutils-libelf-devel. Попробуйте запустить: sudo apt-get install libelf-dev а затем снова продуть и установить. - SudoSURoot
@Terrance Может намекнуть мне, как пойти в это ядро? - John Kent
//, Вот полный текст ошибки, которую я получил из запроса «обнаружена система»: bcmwl-kernel-source 6.30.223.271 + bdcom-0ubuntu1 ~ 1.2: модуль bcmwl kerne l не смог построить Я нахожусь на рынке для новый компьютер, и с такой BS новая ОС Mac начинает выглядеть все более привлекательной. - Nathan Basanese


ответы:


Канонический обновленный стек HWE для Ubuntu 16.04 для ядра 4.15. Но они забыли обновить беспроводной драйвер Broadcom, поэтому его можно построить. Это критическая и очень глупая ошибка, которая вызовет проблемы для многих людей, использующих LTS.

Теперь проблема исправлена, и была создана совместимая версия драйвера

Эта проблема может быть решена путем установки совместимой версии bcmwl-kernel-source который должен основываться на ядрах 4.15.

Скачать http://archive.ubuntu.com/ubuntu/pool/restricted/b/bcmwl/bcmwl-kernel-source_6.30.223.271+bdcom-0ubuntu1~1.3_amd64.deb

и установите его, используя dkpg,

Это можно сделать

wget http://archive.ubuntu.com/ubuntu/pool/restricted/b/bcmwl/bcmwl-kernel-source_6.30.223.271+bdcom-0ubuntu1~1.3_amd64.deb
sudo dpkg -i bcmwl-kernel-source_6.30.223.271+bdcom-0ubuntu1~1.3_amd64.deb

Windows не связана вообще.

Проблема в том, что у вас есть ядро, которое несовместимо с Водитель.

Важный: Если у вас нет другого сетевого подключения, кроме Broadcom Wi-Fi, вы можете загрузиться с предыдущим ядром с помощью меню grub и установить драйвер. Он должен строить для всех ядер.


29
2017-07-05 14:18



Комментарии не предназначены для расширенного обсуждения; этот разговор был переехал в чат, - Thomas Ward♦
@DavidFoerster Я изменил ответ и дал ссылку на драйвер, построенный для 16.04. Это версия, которая будет вскоре добавлена ​​в репозитории. Нет никакой разницы, кроме номера версии, но вы правы, что лучше использовать эту для будущих возможных обновлений, если таковые имеются. - Pilot6
Они также сломали драйвер r8168-dkms. См. Мой ответ на askubuntu.com/questions/1052971/... Больше подробностей. - heynnema
@heynnema Как вы все получаете ядро ​​4.15? Это proposed репо. Ничто не сломано для тех, кто не работает перед поездом. - Pilot6
@ Pilot6, как вы упомянули в своем ответе «Канонический обновленный стек HWE для Ubuntu 16.04 для ядра 4.15». Другие пользователи говорят то же самое ... что они работают на 4.15 на 16.04 LTS, и, как мне подсказывает моя ссылка, также требуются, чтобы более новые драйверы были на 100% работоспособны снова. Я не спросил, работают ли они, или нет. - heynnema


По поводу хорошего ответа Pilot6 на этот вопрос, это выглядит как официальное исправление для xenial (т. е. не требуется устанавливать пакеты из bionic) был выпущен (если вы используете пакет broadcom-sta), или же совершенное (если вы используете пакет bcmwl которая обеспечивает bcmwl-kernel-source).

Для получения дополнительной информации см .:

Broadcom-STA: https://bugs.launchpad.net/ubuntu/+source/broadcom-sta/+bug/1777444

bcmwl: https://bugs.launchpad.net/ubuntu/+source/bcmwl/+bug/1777646


5
2017-07-05 19:15